windows build error in ctk python wrapping

classic Classic list List threaded Threaded
3 messages Options
Reply | Threaded
Open this post in threaded view
|

windows build error in ctk python wrapping

pieper
Administrator
I get this with win32 RelWithDebInfo vs9 on win7:

> 8>5>3>PythonQt Light Wrapping - Generating org_commontk_CTKWidgets_init.cpp
> 8>5>1>mt.exe : general error c101008a: Failed to save the updated manifest to the file ".\CTKCore.dir\RelWithDebInfo\CTKCore.dll.embed.manifest". The parameter is incorrect.
> 8>5>1>Build log was saved at "file://c:\cygwin\home\pieper\slicer4\latest\Slicer4-superbuild\CTK-build\CTK-build\Libs\Core\CTKCore.dir\RelWithDebInfo\BuildLog.htm"
> 8>5>1>CTKCore - 1 error(s), 0 warning(s)

> ...

Then the build fails with these errors, which might be related...

> 8>5>11>Performing Post-Build Event...
> 8>5>11>Build log was saved at "file://c:\cygwin\home\pieper\slicer4\latest\Slicer4-superbuild\CTK-build\CTK-build\Libs\Visualization\VTK\Widgets\Plugins\CTKVisualizationVTKWidgetsPlugins.dir\RelWithDebInfo\BuildLog.htm"
> 8>5>11>CTKVisualizationVTKWidgetsPlugins - 0 error(s), 0 warning(s)
> 8>5>========== Build: 10 succeeded, 1 failed, 7 up-to-date, 0 skipped ==========
> 8>5>Project : error PRJ0019: A tool returned an error code from "Performing build step for 'CTK-build'"
> 8>5>Build log was saved at "file://c:\cygwin\home\pieper\slicer4\latest\Slicer4-superbuild\CTK-build\CTK-build.dir\RelWithDebInfo\BuildLog.htm"
> 8>5>CTK-build - 2 error(s), 0 warning(s)
> 8>========== Build: 4 succeeded, 1 failed, 3 up-to-date, 0 skipped ==========
> 8>Project : error PRJ0019: A tool returned an error code from "Performing build step for 'CTK'"
> 8>Build log was saved at "file://c:\cygwin\home\pieper\slicer4\latest\Slicer4-superbuild\CTK.dir\RelWithDebInfo\BuildLog.htm"
> 8>CTK - 3 error(s), 0 warning(s)
>

Any ideas?

-Steve

_______________________________________________
slicer-devel mailing list
[hidden email]
http://massmail.spl.harvard.edu/mailman/listinfo/slicer-devel
To unsubscribe: send email to [hidden email] with unsubscribe as the subject
Reply | Threaded
Open this post in threaded view
|

Re: windows build error in ctk python wrapping

Jean-Christophe Fillion-Robin
Could you try from directory having a "shorter" length.

For example:

  file://c:\projects\Slicer4-superbuild

instead of

  file://c:\cygwin\home\pieper\slicer4\latest\Slicer4-superbuild



Can you reproduce that error systematically ?
Are you building with multiple process ? (Option /MT)

Thks
Jc

On Fri, Feb 25, 2011 at 2:21 PM, Steve Pieper <[hidden email]> wrote:
I get this with win32 RelWithDebInfo vs9 on win7:

> 8>5>3>PythonQt Light Wrapping - Generating org_commontk_CTKWidgets_init.cpp
> 8>5>1>mt.exe : general error c101008a: Failed to save the updated manifest to the file ".\CTKCore.dir\RelWithDebInfo\CTKCore.dll.embed.manifest". The parameter is incorrect.
> 8>5>1>Build log was saved at "file://c:\cygwin\home\pieper\slicer4\latest\Slicer4-superbuild\CTK-build\CTK-build\Libs\Core\CTKCore.dir\RelWithDebInfo\BuildLog.htm"
> 8>5>1>CTKCore - 1 error(s), 0 warning(s)

> ...

Then the build fails with these errors, which might be related...

> 8>5>11>Performing Post-Build Event...
> 8>5>11>Build log was saved at "file://c:\cygwin\home\pieper\slicer4\latest\Slicer4-superbuild\CTK-build\CTK-build\Libs\Visualization\VTK\Widgets\Plugins\CTKVisualizationVTKWidgetsPlugins.dir\RelWithDebInfo\BuildLog.htm"
> 8>5>11>CTKVisualizationVTKWidgetsPlugins - 0 error(s), 0 warning(s)
> 8>5>========== Build: 10 succeeded, 1 failed, 7 up-to-date, 0 skipped ==========
> 8>5>Project : error PRJ0019: A tool returned an error code from "Performing build step for 'CTK-build'"
> 8>5>Build log was saved at "file://c:\cygwin\home\pieper\slicer4\latest\Slicer4-superbuild\CTK-build\CTK-build.dir\RelWithDebInfo\BuildLog.htm"
> 8>5>CTK-build - 2 error(s), 0 warning(s)
> 8>========== Build: 4 succeeded, 1 failed, 3 up-to-date, 0 skipped ==========
> 8>Project : error PRJ0019: A tool returned an error code from "Performing build step for 'CTK'"
> 8>Build log was saved at "file://c:\cygwin\home\pieper\slicer4\latest\Slicer4-superbuild\CTK.dir\RelWithDebInfo\BuildLog.htm"
> 8>CTK - 3 error(s), 0 warning(s)
>

Any ideas?

-Steve

_______________________________________________
slicer-devel mailing list
[hidden email]
http://massmail.spl.harvard.edu/mailman/listinfo/slicer-devel
To unsubscribe: send email to [hidden email] with unsubscribe as the subject



--
+1 919 869 8849


_______________________________________________
slicer-devel mailing list
[hidden email]
http://massmail.spl.harvard.edu/mailman/listinfo/slicer-devel
To unsubscribe: send email to [hidden email] with unsubscribe as the subject
Reply | Threaded
Open this post in threaded view
|

Re: windows build error in ctk python wrapping

pieper
Administrator
Thanks for the hints Jc - I'll try a fresh build in a dir with a short
path and then also in the single process mode.

On 02/25/2011 02:59 PM, Jean-Christophe Fillion-Robin wrote:

> Could you try from directory having a "shorter" length.
>
> For example:
>
>    file://c:\projects\Slicer4-superbuild
>
> instead of
>
>    file://c:\cygwin\home\pieper\slicer4\latest\Slicer4-superbuild
>
>
>
> Can you reproduce that error systematically ?
> Are you building with multiple process ? (Option /MT)
>
> Thks
> Jc
>
> On Fri, Feb 25, 2011 at 2:21 PM, Steve Pieper <[hidden email]
> <mailto:[hidden email]>> wrote:
>
>     I get this with win32 RelWithDebInfo vs9 on win7:
>
>      > 8>5>3>PythonQt Light Wrapping - Generating
>     org_commontk_CTKWidgets_init.cpp
>      > 8>5>1>mt.exe : general error c101008a: Failed to save the updated
>     manifest to the file
>     ".\CTKCore.dir\RelWithDebInfo\CTKCore.dll.embed.manifest". The
>     parameter is incorrect.
>      > 8>5>1>Build log was saved at
>     "file://c:\cygwin\home\pieper\slicer4\latest\Slicer4-superbuild\CTK-build\CTK-build\Libs\Core\CTKCore.dir\RelWithDebInfo\BuildLog.htm"
>      > 8>5>1>CTKCore - 1 error(s), 0 warning(s)
>
>      > ...
>
>     Then the build fails with these errors, which might be related...
>
>      > 8>5>11>Performing Post-Build Event...
>      > 8>5>11>Build log was saved at
>     "file://c:\cygwin\home\pieper\slicer4\latest\Slicer4-superbuild\CTK-build\CTK-build\Libs\Visualization\VTK\Widgets\Plugins\CTKVisualizationVTKWidgetsPlugins.dir\RelWithDebInfo\BuildLog.htm"
>      > 8>5>11>CTKVisualizationVTKWidgetsPlugins - 0 error(s), 0 warning(s)
>      > 8>5>========== Build: 10 succeeded, 1 failed, 7 up-to-date, 0
>     skipped ==========
>      > 8>5>Project : error PRJ0019: A tool returned an error code from
>     "Performing build step for 'CTK-build'"
>      > 8>5>Build log was saved at
>     "file://c:\cygwin\home\pieper\slicer4\latest\Slicer4-superbuild\CTK-build\CTK-build.dir\RelWithDebInfo\BuildLog.htm"
>      > 8>5>CTK-build - 2 error(s), 0 warning(s)
>      > 8>========== Build: 4 succeeded, 1 failed, 3 up-to-date, 0
>     skipped ==========
>      > 8>Project : error PRJ0019: A tool returned an error code from
>     "Performing build step for 'CTK'"
>      > 8>Build log was saved at
>     "file://c:\cygwin\home\pieper\slicer4\latest\Slicer4-superbuild\CTK.dir\RelWithDebInfo\BuildLog.htm"
>      > 8>CTK - 3 error(s), 0 warning(s)
>      >
>
>     Any ideas?
>
>     -Steve
>
>     _______________________________________________
>     slicer-devel mailing list
>     [hidden email] <mailto:[hidden email]>
>     http://massmail.spl.harvard.edu/mailman/listinfo/slicer-devel
>     To unsubscribe: send email to
>     [hidden email]
>     <mailto:[hidden email]> with
>     unsubscribe as the subject
>
>
>
>
> --
> +1 919 869 8849
>
_______________________________________________
slicer-devel mailing list
[hidden email]
http://massmail.spl.harvard.edu/mailman/listinfo/slicer-devel
To unsubscribe: send email to [hidden email] with unsubscribe as the subject